{"text_format":"1","workbook":"xlsx","n_sheets":14,"sheets":["Process Flow","Application","Page 1","Page 2","Page 3","Page 4","Page 5","Page 6","Page 7","Page 8","Scorecard","Commentary","Scoring Criteria","Data"],"not_rendered":{"charts":0,"images":2,"macros":1,"external_links":1,"defined_names":538,"comments":0,"pivot_tables":0},"unopened":[],"bounds":{"document_bytes":16777216,"sheet_cells":100000,"rows_first":2000,"rows_last":500,"rows_between":2000,"halvings":0,"cell_chars":16384,"cell_head_chars":4096},"cells_cut":0,"cells_raw":0,"read":"whole","date_system":"1900"}

{"sheet":"Process Flow","index":0,"n_rows":27,"n_cols":7,"rows_kept":27,"cut":false,"hidden":false,"merged":[[0,0,0,13]]}
["Process Flow Chart for the Application and Assessment for Minor Lighting Impovement Schemes on the National Road Network "]
[]
[]
[]
[]
[]
[]
[]
[]
[]
[]
[]
[]
[]
[]
[]
[]
[]
[]
[]
{"$rows_left_out":8}
{"sheet":"Application","index":1,"n_rows":205,"n_cols":11,"rows_kept":205,"cut":false,"hidden":true,"merged":[[190,2,190,9],[191,2,191,9],[185,1,185,10],[176,3,176,9],[174,3,174,9],[188,2,188,9],[189,2,189,9],[33,1,33,4],[56,5,56,6],[170,3,172,9],[180,3,182,9],[164,3,164,9],[166,3,166,9],[178,3,178,9],[168,3,168,9],[159,3,159,9],[65,2,65,9],[70,1,70,7],[82,1,82,7],[69,2,69,9],[80,1,80,7],[86,1,86,7],[110,2,120,9],[154,2,154,9],[102,2,102,9],[104,2,104,9],[37,2,37,9],[1,1,1,9],[29,2,29,9],[31,2,31,9],[3,2,3,9],[35,2,35,9],[8,6,8,8],[15,1,15,9],[25,4,25,9],[6,1,6,9],[11,1,11,9],[21,1,21,9],[9,6,9,8],[84,1,84,7],[56,7,56,8],[57,5,57,6],[57,7,57,8],[152,2,152,9],[149,1,149,10],[72,7,72,8],[73,1,76,2],[74,3,75,8],[204,1,204,10],[205,1,205,10],[192,1,192,10],[23,8,23,9],[87,1,95,9],[186,2,186,9],[187,2,187,9],[157,1,157,9],[55,5,55,6],[55,7,55,8],[131,1,131,9],[107,1,107,10],[100,1,100,10],[101,2,101,9],[199,1,199,10],[200,1,200,10],[201,1,201,10],[202,1,202,10],[203,1,203,10],[194,1,194,10],[195,1,195,10],[196,1,196,10],[197,1,197,10],[198,1,198,10]]}
[null,"Appraisal of Route Lighting Tool"]
[null,"Section A - Scheme Overview"]
[]
[null,"Scheme Title"]
[]
[null,"Brief Scheme Description (use Annex A for further details if required)"]
[]
[null,null,"From",null,null,null,"To"]
[null,"ITM co-ordinates"]
[null,null,"(Easting)","(Northing)",null,null,"(Easting)",null,null,"(Northing)"]
[null,"Location Map (use Annex A for further details if required)"]
[]
[null,null,null,null,null,null,null,null,"Approx Scheme Length (km)"]
[]
[]
[null,"Section A - Scheme Overview (Continued)"]
[]
[null,"Route Number (s)",null,null,null,null,null,null,"Route Classification"]
[]
[null,"Speed Limit",null,null,null,null,null,null,"AADT Figure"]
{"$rows_left_out":186}
{"sheet":"Page 1","index":2,"n_rows":13,"n_cols":30,"rows_kept":13,"cut":false,"hidden":false,"merged":[[9,6,9,8],[11,1,11,9],[7,21,8,28],[7,29,8,29],[9,19,10,20],[9,21,10,28],[9,29,10,29],[7,19,8,20],[4,19,5,20],[4,21,5,28],[4,29,5,29],[6,19,6,20],[0,19,0,29],[1,19,1,20],[1,21,1,28],[2,19,3,20],[2,21,3,28],[2,29,3,29],[6,21,6,28],[0,11,3,17],[1,1,1,9],[3,2,3,9],[6,1,6,9],[8,6,8,8],[5,11,8,17]]}
[null,"Appraisal of Route Lighting Tool",null,null,null,null,null,null,null,null,null,"Application Consideration                                                                                                        In order for the application to be fully evaluated, as much information as possible must be provided. Failure to provide all information will result in a lower evaluated score.",null,null,null,null,null,null,null,"   Assessment Criteria for Marking"]
[null,"Section A - Scheme Overview",null,null,null,null,null,null,null,null,null,null,null,null,null,null,null,null,null,"Poor",null,"No details have been provided",null,null,null,null,null,null,null,0]
[null,null,null,null,null,null,null,null,null,null,null,null,null,null,null,null,null,null,null,"Weak",null,"Some details have been provided but the submission lacks any clear evidence and only hints at supporting a neutral or positive impact. ",null,null,null,null,null,null,null,"1 - 3"]
[null,"Scheme Title",null,null,null,null,null,null,null,null,"*"]
[null,null,null,null,null,null,null,null,null,null,null,null,null,null,null,null,null,null,null,"Fair",null,"There are some aspects that would support the application and there is some evidence to suggest that the aspect has been considered and where lighting would provide either a neutral or beneficial impact.  ",null,null,null,null,null,null,null,"4 - 5"]
[null,"Brief Scheme Description ",null,null,null,null,null,null,null,null,null,"Section A & B – Scheme Overview and Scheme Background\nThe applicant is to provide details of the proposed scheme, it's location and general background information so that TII can understand context when reviewing the application.  \n"]
[null,null,null,null,null,null,null,null,null,null,"*",null,null,null,null,null,null,null,null,"Good",null,"A resonable level of information has been provided with evidence that clearly shows due consideration has been given to the aspect and lighting will provide a benefit.",null,null,null,null,null,null,null,"6-7"]
[null,null,"From",null,null,null,"To",null,null,null,null,null,null,null,null,null,null,null,null,"Very Good",null,"The information provides a high degree of confidence that the specific aspect has been fully considered and that the lighting will provide a clear benefit with negligible or no disbenefit.",null,null,null,null,null,null,null,"8 - 9"]
[null,"ITM co-ordinates",null,null,"*",null,null,null,null,null,"*"]
[null,null,"(Easting)","(Northing)",null,null,"(Easting)",null,null,"(Northing)",null,null,null,null,null,null,null,null,null,"Excellent",null,"The information provided is extensive and clearly demonstrates that the implementation of lighting will provide a benefit for the subject matter. ",null,null,null,null,null,null,null,10]
[null,"Location Map"]
[]
[null,null,null,null,null,null,null,null,"Approx Scheme Length (km)",null,"*"]

{"sheet":"Page 2","index":3,"n_rows":24,"n_cols":12,"rows_kept":24,"cut":false,"hidden":true,"merged":[[0,11,3,17],[23,2,23,9],[1,1,1,9],[7,1,7,9],[11,4,11,9],[15,2,15,9],[17,2,17,9],[21,2,21,9],[19,1,19,5]]}
[null,"Appraisal of Route Lighting Tool",null,null,null,null,null,null,null,null,null,"Section A & B – Scheme Overview and Scheme Background\nThe applicant is to provide details of the proposed scheme, it's location and general background information so that TII can understand context when reviewing the application.  \n"]
[null,"Section A - Scheme Overview (Continued)"]
[]
[null,"Route Number (s)",null,"*",null,null,null,null,"Route Classification",null,"*"]
[]
[null,"Speed Limit",null,"*",null,null,null,null,"AADT Figure",null,"*"]
[]
[null,"Section B - Scheme Background"]
[]
[null,"Is this scheme new or an extension to an earlier scheme?",null,null,null,null,null,null,null,null,"*"]
[]
[null,null,null,"If extension how was earlier scheme funded?"]
[]
[null,"When was this work undertaken?",null,null,null,null,"Qtr/Yr"]
[]
[null,"Describe earlier works undertaken"]
[]
[null,"Why was this lighting not provided under earlier scheme?"]
[]
[null,"Does the scheme impact on non-national roads?",null,null,null,null,null,null,null,null,"*"]
{"$rows_left_out":5}
{"sheet":"Page 3","index":4,"n_rows":27,"n_cols":12,"rows_kept":27,"cut":false,"hidden":true,"merged":[[0,11,3,17],[26,2,26,9],[16,5,16,6],[16,7,16,8],[17,5,17,6],[17,7,17,8],[18,5,18,6],[18,7,18,8],[4,11,11,17],[22,11,23,17]]}
[null,"Appraisal of Route Lighting Tool",null,null,null,null,null,null,null,null,null,"Section 1 – Technical\nThis section is to understand the general approach for the technical aspects of the lighting and provides useful information to TII on what is being proposed on the National road network.\n"]
[null,"Section 1 - Technical"]
[]
[null,"Has a Lighting Design been undertaken?",null,null,null,null,null,null,null,null,"*"]
[null,null,null,null,null,null,null,null,null,null,null,"The requirements for road lighting are set out in DN-LHT-03038 - Design of Road Lighting for the National Road Network.  Local Authorities shall take cognisance of these requirements when implementing lighting on the National Road network."]
[null,"What is the Proposed Lighting Class (BS 5489-1:2013)?",null,null,null,null,null,null,null,null,"*"]
[]
[null,"Proposed Luminaire Type",null,null,null,null,null,null,null,null,"*"]
[]
[null,"Will the lighting be metered or unmetered?",null,null,null,null,null,null,null,null,"*"]
[]
[null,"Expected periods of lighting operation",null,null,null,null,null,null,null,null,"*"]
[]
[null,"Will dimming be applied?  ",null,null,null,null,null,null,null,null,"*"]
[]
[null,null,null,null,null,"From",null,"To",null,"% Dimming"]
[null,null,null,null,"If yes, please state dimming levels and periods"]
[]
[]
[]
{"$rows_left_out":8}
{"sheet":"Page 4","index":5,"n_rows":31,"n_cols":12,"rows_kept":31,"cut":false,"hidden":true,"merged":[[0,11,13,21],[19,1,19,7],[21,1,28,9],[2,2,2,9],[3,1,3,7],[13,1,13,7],[15,1,15,7],[17,1,17,7],[4,7,4,8],[4,5,4,6],[5,5,5,6],[5,7,5,8],[7,3,7,8],[6,1,10,2]]}
[null,"Appraisal of Route Lighting Tool",null,null,null,null,null,null,null,null,null,"Section 2 – Safety\nLighting is used as a safety measure on the National Road Network and it's primary purpose is to reduce collisions in the hours of darkness.\nHistorically, it was considered that implementing lighting reduced night time collisions by 30% but recent research undertaken indicates that savings are significantly less than the historical figure. Whilst lighting can provide safety benefits it can also have adverse effects on nearby receptors and the surrounds and its introduction needs careful consideration. TII are seeking documented evidence to support the fact that lighting would as an intervention reduce collisons in the hours of darkness and that some form of assessment has been undertaken that would support this.  This can be in the form of assessment under the Network Safety Ranking Process (GE-STY-01022) or other method of road safety inspection or assessment. It should also be noted that the provision of lighting may not be the most cost effective method of reducing night time accident rates and that improvements to road alignment, improvements in carriageway markings, delineation of traffic and signing may offer a better solution.\n"]
[null,"Section 2 - Safety"]
[]
[null,"Has this site been identified as a High Collision location under the Network Safety Ranking Process (GE-STY-01022)?",null,null,null,null,null,null,null,null,"*"]
[]
[null,null,null,null,null," ",null,"       site ID"]
[null,"Collission rates are available from  https://data.gov.ie/organization/transport-infrastructure-ireland"]
[null,null,null,"Average Collision Rate  for this type of road"]
[]
[null,null,null,null,null,null,null,null,"Site Collision Rate "]
[]
[]
[]
[null,"If the GE-STY-01022 process has not been fully undertaken please state status of review"]
[]
[null,"Did the GE-STY-01022 process identify that lighting as an intervention will reduce collisions?"]
[]
[null,"If site has not been identified as a High Collision location, has a Road Safety Inspection (IAM-STY-06044) been undertaken and did it identify a safety benefit in providing lighting? (please provide supporting evidence)",null,null,null,null,null,null,null,null,"*"]
[]
[null,"If no to both the Network Safety Ranking Process and Road Safety Inspection please state safety work undertaken and benefits that lighting will bring (Please provide supporting evidence):"]
{"$rows_left_out":12}
{"sheet":"Page 5","index":6,"n_rows":6,"n_cols":12,"rows_kept":6,"cut":false,"hidden":true,"merged":[[1,1,1,10],[2,2,2,9],[3,2,3,9],[5,2,5,9],[0,11,3,17]]}
[null,"Appraisal of Route Lighting Tool",null,null,null,null,null,null,null,null,null,"Section 3 – Accessibility & Integration\nIt is accepted that safety, whilst the primary reason for lighting on the National road network, is not the only reason to be considered when introducing lighting. \nThe applicants should clearly state where lighting will help reduce severance, provide benefits for NMUs particularly in support of encouraging physical fitness, support ‘greener’ methods of commuting.\nThe applicant should clearly set out why lighting is considered to provide benefits and provide any evidence of support or statistics to support the provision of public lighting.\n\n"]
[null,"Section 3 - Accessibility & Integration"]
[]
[null,"Will lighting reduce severance?  Please explain.",null,null,null,null,null,null,null,null,"*"]
[]
[null,"Impact of proposed lighting on Non Motorised Users (NMU)?",null,null,null,null,null,null,null,null,"*"]

{"sheet":"Page 6","index":7,"n_rows":23,"n_cols":12,"rows_kept":23,"cut":false,"hidden":true,"merged":[[1,1,1,10],[4,2,14,9],[0,11,6,20]]}
[null,"Appraisal of Route Lighting Tool",null,null,null,null,null,null,null,null,null,"Section 4 – Environmental Impact\nThe introduction of lighting can have adverse impact on the environment.\nIn particular, this can be in areas where the surrounds are intrinsically dark or have low district brightness and the introduction of lighting in villages and relatively dark outer locations will have an impact and lead to ‘light sprawl’.\nA move from an unlit area into a lit area may have implications on local flora and fauna. TII are seeking to understand that the impact of introducing lighting in environmental terms have been considered and adverse effects are clearly understood.  Local Authorities should clearly state environmental assessments that have been undertaken and provide assurance that the introduction of lighting will not have detrimental effects on the nearby receptors.\n"]
[null,"Section 4 - Environment Impact"]
[]
[]
[null,"What environmental assessment has been undertaken and what methods are proposed that will mitigate impact on landscape, townscape and ecology?",null,null,null,null,null,null,null,null,"*"]
[]
[]
[]
[]
[]
[]
[]
[]
[]
[]
[]
[null,null,null,null,null,null,null,null,"Environmental Zone (refer to ILP Guidance Note GN01:2011)",null,"*"]
[null,"Zone","Surrounding","Lighting Environment"]
[null,"E0","Protected","Dark"]
[null,"E1","Natural","Intrinsically Dark"]
{"$rows_left_out":4}
{"sheet":"Page 7","index":8,"n_rows":25,"n_cols":12,"rows_kept":25,"cut":false,"hidden":true,"merged":[[1,1,1,9],[19,1,19,10],[22,2,22,9],[24,2,24,9],[0,11,3,17],[19,11,23,18]]}
[null,"Appraisal of Route Lighting Tool",null,null,null,null,null,null,null,null,null,"Section 5 – Economy\nTII need to understand the funding that Local Authorities are seeking for lighting both in terms of capital and revenue costs.  BCR, NPV assessment if known and applicable should be provided but is not mandatory for the purposes of the application.\n\n"]
[null,"Section 5 - Economy"]
[]
[null,"Estimated Overall Capital Cost of the Scheme",null,null,null,null,null,null,null,null,"*"]
[]
[null,"Estimated Capital Cost attributable to the Lighting Works",null,null,null,null,null,null,null,null,"*"]
[null,null,null,null,null,"as a scheme %",null,null,null,null,"*"]
[]
[null,"Estimated Annual Maintenance costs per annum?",null,null,null,null,null,null,null,null,"*"]
[]
[null,"Estimated Annual Energy Consumption of proposed lighting (kW)",null,null,null,null,null,null,null,null,"*"]
[]
[null,"Estimated Cost of Energy per annum",null,null,null,null,null,null,null,null,"*"]
[]
[null,"If known, please state:",null,null,null,null,null,"Benefit Cost Ration (BCR)"]
[null,null,null,null,null,null,null,"Net Present Value (NPV)"]
[null,null,null,null,null,null,null,"First Year Rate of Return % (FYRR)"]
[null,null,null,null,null,null,null,"Assessment Period (Years)"]
[]
[null,"Section 6 - Any other Supporting Information",null,null,null,null,null,null,null,null,null,"Section 6 – Any supporting Information\nThe earlier section should capture most of the information relating to introducing lighting that will help ensure a balanced assessment is given when TII consider an application for the provision of public lighting.  \nIt is accepted that there may be other considerations, particularly other supporting evidence from community groups that support and provide justification for introducing lighting.  The applicant should use this section to include these details.\n"]
{"$rows_left_out":6}
{"sheet":"Page 8","index":9,"n_rows":1103,"n_cols":11,"rows_kept":1103,"cut":false,"hidden":true,"merged":[[24,3,26,9],[10,3,10,9],[1,1,1,9],[3,3,3,9],[8,3,8,9],[12,3,12,9],[22,3,22,9],[18,3,18,9],[20,3,20,9],[14,3,16,9]]}
[null,"Appraisal of Route Lighting Tool"]
[null,"Section 7 - Local Authority Contact Details"]
[]
[null,"Local Authority",null,null,null,null,null,null,null,null,"*"]
[]
[null,"Contact Details"]
[]
[null,"Primary Contact Details"]
[null,null,"Name",null,null,null,null,null,null,null,"*"]
[]
[null,null,"Telephone",null,null,null,null,null,null,null,"*"]
[]
[null,null,"Email",null,null,null,null,null,null,null,"*"]
[]
[null,null,"Address",null,null,null,null,null,null,null,"*"]
[]
[]
[null,"Secondary Contact Details"]
[null,null,"Name"]
[]
{"$rows_left_out":1084}
{"sheet":"Scorecard","index":10,"n_rows":52,"n_cols":25,"rows_kept":52,"cut":false,"hidden":true,"merged":[[46,3,46,4],[0,7,0,8],[0,0,0,5],[40,3,40,4],[31,3,31,4],[35,3,35,4],[22,3,22,4],[14,3,14,4],[8,3,8,4],[2,3,2,4],[37,1,37,4],[47,10,50,20],[46,10,46,20],[1,11,1,20],[7,12,7,13],[7,18,7,19],[14,10,14,20],[22,10,22,20],[15,10,21,20],[23,10,30,20],[32,10,34,20],[36,10,39,20],[41,10,45,20],[31,10,31,20],[35,10,35,20],[40,10,40,20]]}
["Appraisal of Route Lighting - Score Calculator",null,null,null,null,null,null,null,null,null,null,"Appraisal of Route Lighting Tool"]
[null,"Section",null,null,null,"Evaluation","Points","Weighting","Score",null,null,"Section 9 - (For internal TII use only)",null,null,null,null,null,null,null,null,null,null,null,0,"Approved"]
[null,"Section A",null,null,null,null,null,null,null,null,null,null,null,null,null,null,null,null,null,null,null,null,null,1,"Refused "]
[null,null,null,null,null,null,null,null,null,null,null,"Submission Date by Authority",null,null,null,null,null,null,null,null,null,null,null,2,"Rejected"]
[null,"Not Scored",null,null,null,null,null,null,null,null,null,null,null,null,null,null,null,null,null,null,null,null,null,3]
[null,null,null,null,null,null,null,null,null,null,null,null,null,null,null,null,"TII Approval ",null,null,null,null,null,null,4]
[null,null,null,null,null,null,null,null,null,null,null,null,null,null,null,null,"Date",null,null,null,null,null,null,5]
[null,null,null,null,null,null,null,null,null,null,null,"Name:",null,null,null,"Signature",null,null,null,null,null,null,null,6]
[null,"Section B",null,null,null,null,null,null,null,null,null,null,null,null,null,null,null,null,null,null,null,null,null,7]
[null,null,null,null,null,null,null,null,null,null,null,null,null,null,null,null,null,null,null,null,null,null,null,8]
[null,"Not Scored",null,null,null,null,null,null,null,null,null,null,null,null,null,null,null,null,null,null,null,null,null,9]
[null,null,null,null,null,null,null,null,null,null,null,null,null,null,null,null,null,null,null,null,null,null,null,10]
[]
[]
[null,"Section 1 ",null,"Technical",null,null,null,null,null,null,"Section 1                                                    Reviewers Comments"]
[null,"Has a Lighting Design been undertaken?",null,null,null,{"$f":"IF(Application!J43=\"Yes\",TRUE,FALSE)","v":false},{"$f":"IF(F16=FALSE,0,1)","v":0},1,{"$f":"G16*H16","v":0}]
[null,"Has a Lighting Class been determined?",null,null,null,{"$f":"IF(Application!J45<>\"\",TRUE,FALSE)","v":false},{"$f":"IF(F17=FALSE,0,1)","v":0},1,{"$f":"G17*H17","v":0}]
[null,"Will dimming be applied?  ",null,null,null,{"$f":"IF(Application!J53=\"Yes\",TRUE,FALSE)","v":false},{"$f":"IF(F18=FALSE,0,1)","v":0},3,{"$f":"G18*H18","v":0}]
[]
[]
{"$rows_left_out":33}
{"sheet":"Commentary","index":11,"n_rows":35,"n_cols":2,"rows_kept":35,"cut":false,"hidden":true,"merged":[]}
[]
["Commentary and guidance for TII reviewer"]
[]
[]
[]
[1,"The purpose of the Lighting Appraisal Tool is to capture sufficient information in order to understand and make an informed decision for providing financial support for lighting on the road network from Local Authorities"]
[]
[2,"The Lighting Appraisal Tool is limited in its application and it is not intended to support the decision for the funding of major lighting schemes.  "]
[]
[3,"The intention of this tool is to assist TII in determining funding support when requests from Local Authorities are made and to ensure a consistent and balanced approach when agreeing to funding. "]
[]
[4,"Some applications may be very minor in terms of infrastruture and the extent of information requested could be considered excessive.  The appropriateness of the tool should be assessed on a regular basis and adjustments made to maximise its benefit for all parties."]
[]
[5,"Assessment is based the following around 6 criteria:"]
[]
[null,"- Technical"]
[null,"- Safety"]
[null,"- Accessibility & Intergration"]
[null,"- Environmental"]
[null,"- Economy (Not Scored)"]
{"$rows_left_out":16}
{"sheet":"Scoring Criteria","index":12,"n_rows":11,"n_cols":15,"rows_kept":11,"cut":false,"hidden":true,"merged":[[10,7,10,14],[8,2,8,13],[3,2,3,13],[4,2,4,13],[5,2,5,13],[6,2,6,13],[7,2,7,13]]}
[null,"Assessment Criteria for Marking"]
[]
[]
[null,"Poor","No details have been provided",null,null,null,null,null,null,null,null,null,null,null,"0"]
[null,"Weak","Some details have been provided but the submission lacks any clear evidence and only hints at supporting a neutral or positive impact. ",null,null,null,null,null,null,null,null,null,null,null,"1-3"]
[null,"Fair","There are some aspects that would support the application and there is some evidence to suggest that the aspect has been considered and where lighting would provide either a neutral or beneficial impact.  ",null,null,null,null,null,null,null,null,null,null,null,"4-5"]
[null,"Good","A resonable level of information has been provided with evidence that clearly shows due consideration has been given to the aspect and lighting will provide a benefit.",null,null,null,null,null,null,null,null,null,null,null,"6-7"]
[null,"Very Good","The information provides a high degree of confidence that the specific aspect has been fully considered and that the lighting will provide a clear benefit with negligible or no disbenefit.",null,null,null,null,null,null,null,null,null,null,null,"8-9"]
[null,"Excellent","The information provided is extensive and clearly demonstrates that the implementation of lighting will provide a benefit for the subject matter. ",null,null,null,null,null,null,null,null,null,null,null,"10"]
[]
[null,null,null,null,null,null,null,"Note: Applicants must achieve a score greater than 100 in order to receive approval"]

{"sheet":"Data","index":13,"n_rows":1111,"n_cols":24,"rows_kept":1111,"cut":false,"hidden":true,"merged":[]}
["Yes","Motorway","To Be Deterimined","Metered","LED","Zone E1","Adverse","Additional","New","No",0,600,"Carlow","LED","E0",10,null,"Approved",null,"None",null,null,"To Be Determined","0-5000"]
["No","Rural Dual Carriagway","M1/ME1","Unmetered","SON ","Zone E2","Slightly Adverse","Removal","Extended","N/A",1,400,"Cavan","Other","E1",20,null,"Refused",null,"Not Identified for Review",null,null,"D2D","5000-10000"]
["To Be Determined","Urban dual Carriageway","M2/ME2","To Be Determined","SOX","Zone E3","Neutral",null,null,null,2,250,"Clare",null,"E2",30,null,"Rejected",null,"Review In Process",null,null,"D2M","10000-20000"]
[null,"Rural Two Lane (Single Carriageway)","M3/ME3",null,"MH","Zone E4","Slightly Beneficial",null,null,null,3,150,"Cork City",null,"E3",40,null,null,null,"Scheme Proposed",null,null,"70/35 Lux","20000+"]
["Pass","Urban Two Lane (Single Carriageway)","M4/ME4",null,"Other",null,"Beneficial",null,null,null,4,180,"Cork County",null,"E4",50,null,null,null,"Initial Desktop Study",null,null,"55/28 Lux"]
["Fail",null,"M5/ME5",null,"To Be Determined",null,null,null,null,null,5,135,"Donegal",null,null,60,null,null,null,"Detailed Desk Study",null,null,"35/35 Lux"]
[null,null,"M/6ME6",null,null,null,null,null,null,null,6,100,"Dublin City",null,null,70,null,null,null,"Site Assessment",null,null,"35/18 Lux"]
[null,null,"S1",null,null,null,null,null,null,null,7,90,"Dun Laoghaire Rathdown",null,null,80,null,null,null,"Problem Definition",null,null,"20/20 Lux"]
["Yes",null,"S2",null,null,null,null,null,null,null,8,70,"Fingal",null,null,90,null,null,null,"Measures to Resolve",null,null,"PNSO"]
["No",null,"S3",null,null,null,null,null,null,null,9,55,"Galway City",null,null,100,null,null,null,null,null,null,"Time Switch"]
["N/A",null,"S4",null,null,null,null,null,null,null,10,"Other","Galway County",null,null,110,null,null,null,null,null,null,"CMS"]
[null,null,"S5",null,null,null,null,null,null,null,11,null,"Kerry",null,null,120]
[null,null,"S6",null,null,null,null,null,null,null,12,null,"Kildare"]
[null,null,"P1",null,null,null,null,null,null,null,13,null,"Kilkenny"]
[null,null,"P2",null,null,null,null,null,null,null,14,null,"Laois"]
[null,null,"P3",null,null,null,null,null,null,null,15,null,"Leitrim"]
[null,null,"P4",null,null,null,null,null,null,null,16,null,"Limerick"]
[null,null,"P5",null,null,null,null,null,null,null,17,null,"Longford"]
[null,null,"P6",null,null,null,null,null,null,null,18,null,"Louth"]
[null,null,"CE0",null,null,null,null,null,null,null,19,null,"Mayo"]
{"$rows_left_out":1091}